��17�\�@�̔��ړI�̖�ؗނ̍앨�ʍ�t�i�͔|�j�o�c�̐��ƍ�t�i�͔|�j�ʐ�,���������t���o�c�̐�,��������I�n��t�o�c�̐�,��������I�n��t�ʐ�,��������{�ݍ�t�o�c�̐�,��������{�ݍ�t�ʐ�,�ɂ񂶂��t���o�c�̐�,�ɂ񂶂�I�n��t�o�c�̐�,�ɂ񂶂�I�n��t�ʐ�,�ɂ񂶂�{�ݍ�t�o�c�̐�,�ɂ񂶂�{�ݍ�t�ʐ�,���Ƃ�����t���o�c�̐�,���Ƃ����I�n��t�o�c�̐�,���Ƃ����I�n��t�ʐ�,���Ƃ����{�ݍ�t�o�c�̐�,���Ƃ����{�ݍ�t�ʐ�,��܂̂����i�Ȃ������Ȃǁj��t���o�c�̐�,��܂̂����i�Ȃ������Ȃǁj�I�n��t�o�c�̐�,��܂̂����i�Ȃ������Ȃǁj�I�n��t�ʐ�,��܂̂����i�Ȃ������Ȃǁj�{�ݍ�t�o�c�̐�,��܂̂����i�Ȃ������Ȃǁj�{�ݍ�t�ʐ�,�͂�������t���o�c�̐�,�͂������I�n��t�o�c�̐�,�͂������I�n��t�ʐ�,�͂������{�ݍ�t�o�c�̐�,�͂������{�ݍ�t�ʐ�,�L���x�c��t���o�c�̐�,�L���x�c�I�n��t�o�c�̐�,�L���x�c�I�n��t�ʐ�,�L���x�c�{�ݍ�t�o�c�̐�,�L���x�c�{�ݍ�t�ʐ�,�ق���񂻂���t���o�c�̐�,�ق���񂻂��I�n��t�o�c�̐�,�ق���񂻂��I�n��t�ʐ�,�ق���񂻂��{�ݍ�t�o�c�̐�,�ق���񂻂��{�ݍ�t�ʐ�,���^�X��t���o�c�̐�,���^�X�I�n��t�o�c�̐�,���^�X�I�n��t�ʐ�,���^�X�{�ݍ�t�o�c�̐�,���^�X�{�ݍ�t�ʐ�,�˂���t���o�c�̐�,�˂��I�n��t�o�c�̐�,�˂��I�n��t�ʐ�,�˂��{�ݍ�t�o�c�̐�,�˂��{�ݍ�t�ʐ�,���܂˂���t���o�c�̐�,���܂˂��I�n��t�o�c�̐�,���܂˂��I�n��t�ʐ�,���܂˂��{�ݍ�t�o�c�̐�,���܂˂��{�ݍ�t�ʐ�,�u���b�R���[��t���o�c�̐�,�u���b�R���[�I�n��t�o�c�̐�,�u���b�R���[�I�n��t�ʐ�,�u���b�R���[�{�ݍ�t�o�c�̐�,�u���b�R���[�{�ݍ�t�ʐ�,���イ���t���o�c�̐�,���イ��I�n��t�o�c�̐�,���イ��I�n��t�ʐ�,���イ��{�ݍ�t�o�c�̐�,���イ��{�ݍ�t�ʐ�,�Ȃ���t���o�c�̐�,�Ȃ��I�n��t�o�c�̐�,�Ȃ��I�n��t�ʐ�,�Ȃ��{�ݍ�t�o�c�̐�,�Ȃ��{�ݍ�t�ʐ�,�g�}�g��t���o�c�̐�,�g�}�g�I�n��t�o�c�̐�,�g�}�g�I�n��t�ʐ�,�g�}�g�{�ݍ�t�o�c�̐�,�g�}�g�{�ݍ�t�ʐ�,�s�[�}����t���o�c�̐�,�s�[�}���I�n��t�o�c�̐�,�s�[�}���I�n��t�ʐ�,�s�[�}���{�ݍ�t�o�c�̐�,�s�[�}���{�ݍ�t�ʐ�,��������t���o�c�̐�,�������I�n��t�o�c�̐�,�������I�n��t�ʐ�,�������{�ݍ�t�o�c�̐�,�������{�ݍ�t�ʐ�,��������t���o�c�̐�,�������I�n��t�o�c�̐�,�������I�n��t�ʐ�,�������{�ݍ�t�o�c�̐�,�������{�ݍ�t�ʐ�,��������t���o�c�̐�,�������I�n��t�o�c�̐�,�������I�n��t�ʐ�,�������{�ݍ�t�o�c�̐�,�������{�ݍ�t�ʐ�,���̑��̖�؍�t���o�c�̐�,���̑��̖�ؘI�n��t�o�c�̐�,���̑��̖�ؘI�n��t�ʐ�,���̑��̖�؎{�ݍ�t�o�c�̐�,���̑��̖�؎{�ݍ�t�ʐ�
����,110,110,"3,034",,,37,37,189,,,42,42,312,,,x,8,16,x,x,42,42,498,,,270,270,"24,872",1,x,47,46,341,2,x,24,24,570,2,x,42,42,272,,,52,52,208,,,125,125,"1,271",1,x,74,61,251,16,47,79,73,288,8,13,87,62,300,28,217,35,33,67,4,1,18,2,x,17,344,31,23,363,8,43,46,46,881,,,150,148,"6,489",7,59
���{��s,x,x,x,x,x,x,x,x,x,x,x,x,x,x,x,x,x,x,x,x,x,x,x,x,x,x,x,x,x,x,x,x,x,x,x,x,x,x,x,x,x,x,x,x,x,x,x,x,x,x,x,x,x,x,x,x,x,x,x,x,x,x,x,x,x,x,x,x,x,x,x,x,x,x,x,x,x,x,x,x,x,x,x,x,x,x,x,x,x,x,x,x,x,x,x
�i�Y�꒬�j,7,7,36,,,1,1,x,,,5,5,12,,,x,2,x,x,x,3,3,8,,,7,7,58,,,5,5,10,,,,,,,,3,3,7,,,5,5,11,,,7,7,76,,,7,5,23,2,x,6,3,17,3,4,7,3,10,4,5,3,2,x,1,x,,,,,,,,,,,,,,,,6,6,103,,
�i��Áj,,,,,,,,,,,,,,,,x,,,x,x,,,,,,,,,,,,,,,,,,,,,,,,,,,,,,,,,,,,,,,,,,,,,,,,,,,,,,,,,,,,,,,,,,,,,,,,,,,
�ߊ}��,x,x,x,x,x,x,x,x,x,x,x,x,x,x,x,x,x,x,x,x,x,x,x,x,x,x,x,x,x,x,x,x,x,x,x,x,x,x,x,x,x,x,x,x,x,x,x,x,x,x,x,x,x,x,x,x,x,x,x,x,x,x,x,x,x,x,x,x,x,x,x,x,x,x,x,x,x,x,x,x,x,x,x,x,x,x,x,x,x,x,x,x,x,x,x
�v���l��,5,5,182,,,,,,,,2,2,x,,,x,,,x,x,2,2,x,,,5,5,29,,,3,2,x,1,x,,,,,,1,1,x,,,3,3,14,,,4,4,42,1,x,3,3,6,1,x,4,4,7,,,3,1,x,2,x,,,,,,,,,,,,,,,,,,,,,5,4,55,1,x
���R��,23,23,660,,,12,12,88,,,14,14,217,,,x,1,x,x,x,8,8,45,,,57,57,"4,341",,,13,13,66,,,4,4,45,,,15,15,134,,,12,12,64,,,28,28,259,,,17,10,34,7,22,18,17,95,1,x,22,10,62,13,48,6,6,13,1,x,,,,,,6,6,75,,,15,15,171,,,35,35,811,1,x
��풬,22,22,222,,,6,6,6,,,8,8,23,,,x,1,x,x,x,9,9,21,,,31,31,811,,,6,6,16,,,9,9,475,1,x,7,7,15,,,13,13,31,,,23,23,147,,,21,20,76,1,x,21,20,66,1,x,19,19,76,,,12,11,17,1,x,1,1,x,,,,,,,,,,,,,20,19,371,1,x
�k���Y��,18,18,320,,,9,9,53,,,6,6,32,,,x,1,x,x,x,10,10,234,,,71,71,"7,522",1,x,9,9,93,1,x,6,6,40,,,7,7,75,,,8,8,50,,,27,27,220,,,14,13,85,3,3,12,12,49,2,x,16,13,63,5,44,7,7,21,1,x,16,1,x,16,x,12,4,40,8,43,10,10,154,,,35,35,"3,465",3,18
���䒬,30,30,"1,558",,,7,7,35,,,4,4,7,,,x,,,x,x,9,9,182,,,98,98,"12,109",,,8,8,130,,,5,5,10,1,x,7,7,34,,,8,8,25,,,35,35,525,,,9,7,11,2,x,16,15,48,1,x,18,14,85,4,116,5,5,6,,,1,,,1,x,13,13,248,,,21,21,556,,,45,45,"1,643",1,x
