��18�\�@�̔��ړI�̉ʎ��ނ͔̍|�o�c�̐��ƍ͔|�ʐ�,���B�݂���͔|���o�c�̐�,���B�݂���I�n�͔|�o�c�̐�,���B�݂���I�n�͔|�ʐ�,���B�݂���{�ݍ͔|�o�c�̐�,���B�݂���{�ݍ͔|�ʐ�,���̑��̂��񂫂͔|���o�c�̐�,���̑��̂��񂫂I�n�͔|�o�c�̐�,���̑��̂��񂫂I�n�͔|�ʐ�,���̑��̂��񂫂{�ݍ͔|�o�c�̐�,���̑��̂��񂫂{�ݍ͔|�ʐ�,��񂲍͔|���o�c�̐�,��񂲘I�n�͔|�o�c�̐�,��񂲘I�n�͔|�ʐ�,��񂲎{�ݍ͔|�o�c�̐�,��񂲎{�ݍ͔|�ʐ�,�Ԃǂ��͔|���o�c�̐�,�Ԃǂ��I�n�͔|�o�c�̐�,�Ԃǂ��I�n�͔|�ʐ�,�Ԃǂ��{�ݍ͔|�o�c�̐�,�Ԃǂ��{�ݍ͔|�ʐ�,���{�Ȃ��͔|���o�c�̐�,���{�Ȃ��I�n�͔|�o�c�̐�,���{�Ȃ��I�n�͔|�ʐ�,���{�Ȃ��{�ݍ͔|�o�c�̐�,���{�Ȃ��{�ݍ͔|�ʐ�,���m�Ȃ��͔|���o�c�̐�,���m�Ȃ��I�n�͔|�o�c�̐�,���m�Ȃ��I�n�͔|�ʐ�,���m�Ȃ��{�ݍ͔|�o�c�̐�,���m�Ȃ��{�ݍ͔|�ʐ�,�����͔|���o�c�̐�,�����I�n�͔|�o�c�̐�,�����I�n�͔|�ʐ�,�����{�ݍ͔|�o�c�̐�,�����{�ݍ͔|�ʐ�,�����Ƃ��͔|���o�c�̐�,�����Ƃ��I�n�͔|�o�c�̐�,�����Ƃ��I�n�͔|�ʐ�,�����Ƃ��{�ݍ͔|�o�c�̐�,�����Ƃ��{�ݍ͔|�ʐ�,�т�͔|���o�c�̐�,�т�I�n�͔|�o�c�̐�,�т�I�n�͔|�ʐ�,�т�{�ݍ͔|�o�c�̐�,�т�{�ݍ͔|�ʐ�,�����͔|���o�c�̐�,�����I�n�͔|�o�c�̐�,�����I�n�͔|�ʐ�,�����{�ݍ͔|�o�c�̐�,�����{�ݍ͔|�ʐ�,����͔|���o�c�̐�,����I�n�͔|�o�c�̐�,����I�n�͔|�ʐ�,����{�ݍ͔|�o�c�̐�,����{�ݍ͔|�ʐ�,���ߍ͔|���o�c�̐�,���ߘI�n�͔|�o�c�̐�,���ߘI�n�͔|�ʐ�,���ߎ{�ݍ͔|�o�c�̐�,���ߎ{�ݍ͔|�ʐ�,�������͔|���o�c�̐�,�������I�n�͔|�o�c�̐�,�������I�n�͔|�ʐ�,�������{�ݍ͔|�o�c�̐�,�������{�ݍ͔|�ʐ�,�L�E�C�t���[�c�͔|���o�c�̐�,�L�E�C�t���[�c�I�n�͔|�o�c�̐�,�L�E�C�t���[�c�I�n�͔|�ʐ�,�L�E�C�t���[�c�{�ݍ͔|�o�c�̐�,�L�E�C�t���[�c�{�ݍ͔|�ʐ�,�p�C���A�b�v���͔|���o�c�̐�,�p�C���A�b�v���I�n�͔|�o�c�̐�,�p�C���A�b�v���I�n�͔|�ʐ�,�p�C���A�b�v���{�ݍ͔|�o�c�̐�,�p�C���A�b�v���{�ݍ͔|�ʐ�,���̑��̉ʎ��͔|���o�c�̐�,���̑��̉ʎ��I�n�͔|�o�c�̐�,���̑��̉ʎ��I�n�͔|�ʐ�,���̑��̉ʎ��{�ݍ͔|�o�c�̐�,���̑��̉ʎ��{�ݍ͔|�ʐ�
����,37,37,"2,532",2,x,4,4,31,,,,,,,,,,,,,,,,,,,,,,,x,,,x,x,x,,,x,x,,,,,,1,1,x,,,3,3,16,,,8,8,29,,,x,2,x,x,x,,,,,,,,,,,7,6,70,1,x
���{��s,x,x,x,x,x,x,x,x,x,x,x,x,x,x,x,x,x,x,x,x,x,x,x,x,x,x,x,x,x,x,x,x,x,x,x,x,x,x,x,x,x,x,x,x,x,x,x,x,x,x,x,x,x,x,x,x,x,x,x,x,x,x,x,x,x,x,x,x,x,x,x,x,x,x,x,x,x,x,x,x
�i�Y�꒬�j,4,4,120,,,,,,,,,,,,,,,,,,,,,,,,,,,,x,,,x,x,x,,,x,x,,,,,,,,,,,,,,,,1,1,x,,,x,,,x,x,,,,,,,,,,,,,,,
�i��Áj,,,,,,,,,,,,,,,,,,,,,,,,,,,,,,,x,,,x,x,x,,,x,x,,,,,,,,,,,,,,,,,,,,,x,,,x,x,,,,,,,,,,,,,,,
�ߊ}��,x,x,x,x,x,x,x,x,x,x,x,x,x,x,x,x,x,x,x,x,x,x,x,x,x,x,x,x,x,x,x,x,x,x,x,x,x,x,x,x,x,x,x,x,x,x,x,x,x,x,x,x,x,x,x,x,x,x,x,x,x,x,x,x,x,x,x,x,x,x,x,x,x,x,x,x,x,x,x,x
�v���l��,3,3,35,,,1,1,x,,,,,,,,,,,,,,,,,,,,,,,x,,,x,x,x,,,x,x,,,,,,1,1,x,,,,,,,,,,,,,x,,,x,x,,,,,,,,,,,1,1,x,,
���R��,3,3,55,,,1,1,x,,,,,,,,,,,,,,,,,,,,,,,x,,,x,x,x,,,x,x,,,,,,,,,,,,,,,,2,2,x,,,x,,,x,x,,,,,,,,,,,3,2,x,1,x
��풬,2,2,x,,,,,,,,,,,,,,,,,,,,,,,,,,,,x,,,x,x,x,,,x,x,,,,,,,,,,,,,,,,,,,,,x,,,x,x,,,,,,,,,,,1,1,x,,
�k���Y��,24,24,"2,293",2,x,1,1,x,,,,,,,,,,,,,,,,,,,,,,,x,,,x,x,x,,,x,x,,,,,,,,,,,,,,,,2,2,x,,,x,2,x,x,x,,,,,,,,,,,2,2,x,,
���䒬,,,,,,,,,,,,,,,,,,,,,,,,,,,,,,,x,,,x,x,x,,,x,x,,,,,,,,,,,,,,,,,,,,,x,,,x,x,,,,,,,,,,,,,,,
